SEA-POL
type: Concept
change note: 2020-08-12 15:39:59.0 [sritz] insert AltLabel (id: null category: primary text: SEA-going POLarimetric Doppler Radar language code: en); insert Definition (id: null text: As part of the Salinity Processes in the Upper-ocean Regional Study (SPURS-2) 2017 cruise to the eastern tropical Pacific, the Colorado State University SEA-POL (SEA-going POLarimetric) C-band radar made its first ever ship deployment. Previous ship-based experiments have used Doppler radars to map rainfall and the structure of oceanic convection, but SPURS-2 marked the first time the US research community deployed a dual-polarimetric radar at sea. Dual-polarimetric radar transmits and receives electromagnetic radiation in both horizontal (H) and vertical (V) polarizations simultaneously and thereby makes additional, important measurements of precipitation compared to a single polarization radar, which normally transmits horizontal polarization only. For H-polarization, the electric field vector of the transmit pulse is horizontal to the local Earth’s surface; for V-polarization, the electric field vector is perpendicular to Earth’s surface. Polarization measurements provide information about particle size, shape, and phase (water vs. ice). As a result, superior rain rate estimates are afforded by the dual-polarimetric technology. During SPURS-2, SEA-POL produced rain maps in real time to locate freshwater lenses forming on the ocean’s surface to develop context for oceanographic measurements of surface temperature and salinity. language code: en);
change note: 2020-08-12 15:39:03.0 [sritz] Insert Concept add broader relation (SEA-POL [09dc5c8f-ab07-412e-9f0d-652239cfbafb,560598] - Radar Sounders [6c5ca722-0bc7-4ccd-ad24-39b9d8710140,544471]);
definition: As part of the Salinity Processes in the Upper-ocean Regional Study (SPURS-2) 2017 cruise to the eastern tropical Pacific, the Colorado State University SEA-POL (SEA-going POLarimetric) C-band radar made its first ever ship deployment. Previous ship-based experiments have used Doppler radars to map rainfall and the structure of oceanic convection, but SPURS-2 marked the first time the US research community deployed a dual-polarimetric radar at sea. Dual-polarimetric radar transmits and receives electromagnetic radiation in both horizontal (H) and vertical (V) polarizations simultaneously and thereby makes additional, important measurements of precipitation compared to a single polarization radar, which normally transmits horizontal polarization only. For H-polarization, the electric field vector of the transmit pulse is horizontal to the local Earth’s surface; for V-polarization, the electric field vector is perpendicular to Earth’s surface. Polarization measurements provide information about particle size, shape, and phase (water vs. ice). As a result, superior rain rate estimates are afforded by the dual-polarimetric technology. During SPURS-2, SEA-POL produced rain maps in real time to locate freshwater lenses forming on the ocean’s surface to develop context for oceanographic measurements of surface temperature and salinity.
in scheme: instruments

Radar Sounders
type: Concept