HAPTOPHYTES
type: Concept
change note: 2017-03-15 11:15:38.0 [mgenazzi] Definition added insert Definition (id: null text: Haptophytes are a clade of heterokont algae with smooth flagella. Haptophytes are typically eukaryotic, with a central nucleus and are characterized with a haptonema organelle. language code: en);
definition: Haptophytes are a clade of heterokont algae with smooth flagella. Haptophytes are typically eukaryotic, with a central nucleus and are characterized with a haptonema organelle.
in scheme: sciencekeywords

COCCOLITHOPHORES
type: Concept

MICROALGAE
type: Concept