USDA/FS/SRS
type: Concept
definition: The mission of the USGS Forest Service Southern Research Station is to create the science and technology needed to sustain and enhance southern forest ecosystems and the benefits they provide. Website: "http://www.srs.fs.usda.gov/" [Summary provided by the USDA.]
in scheme: providers

USDA
type: Concept