IMPACTS
type: Concept
change note: 2020-01-02 13:53:42.0 [sritz] insert Definition (id: null text: Winter snowstorms are frequent on the eastern seaboard and cause major disruptions to transportation, commerce, and public safety. Snowfall within these storms is frequently organized in banded structures that are poorly understood by scientists and poorly predicted by current numerical models. Since that last study on snowstorms, the capabilities of remote sensing technologies and numerical weather prediction models have advanced significantly, making now an ideal time to conduct a well-equipped study to identify key processes and improve remote sensing and forecasting of snowfall. More Information: https://espo.nasa.gov/impacts/content/IMPACTS language code: en);
change note: 2020-01-02 13:51:58.0 [sritz] Rename Concept update PrefLabel (IMPACTS);
change note: 2020-01-02 13:52:46.0 [sritz] insert AltLabel (id: null category: primary text: Investigation of Microphysics and Precipitation for Atlantic Coast-Threatening Snowstorms language code: en);
change note: 2020-01-02 13:51:27.0 [sritz] Insert Concept add broader relation (NASA IMPACTS [0ac1326b-77cd-4b5a-a60b-32c5528ff9d0,559593] - G - I [af0968ce-ffe3-44a0-86de-2ec9b9a8fa5d,548857]);
definition: Winter snowstorms are frequent on the eastern seaboard and cause major disruptions to transportation, commerce, and public safety. Snowfall within these storms is frequently organized in banded structures that are poorly understood by scientists and poorly predicted by current numerical models. Since that last study on snowstorms, the capabilities of remote sensing technologies and numerical weather prediction models have advanced significantly, making now an ideal time to conduct a well-equipped study to identify key processes and improve remote sensing and forecasting of snowfall. More Information: https://espo.nasa.gov/impacts/content/IMPACTS
in scheme: projects

G - I
type: Concept