UNICAL
type: Concept
definition: The University of Calabria offers young people a new organization of teaching. Based on the reform of the teaching, the University will award degrees to the first level (called "Graduate"), lasting three years, tier (called "Degree"), with two years of study and qualifications PhD, achieved after a course of study for an additional three years. They can organize, also, the masters of the first and second level and diploma courses and specialization. In this way, it is possible: more flexible and articulate the training offer, while maintaining the quality of the studies and providing numerous options in the choice of training; reduce losses, especially in the first three years of study; dramatically reduce the time to achieve the qualification.
in scheme: providers

ACADEMIC
type: Concept