COULOMETERS
type: Concept
definition: A COULOMETER is a meter that uses coulombs (a unit of electrical charge equal to the amount of charge transferred by a current of 1 ampere in 1 second) to help measure.
in scheme: instruments

Electrical Meters
type: Concept