PAM-II
type: Concept
change note: 2022-02-08 14:45:56.0 [tstevens] update Definition (Portable Automated Mesonet II (PAM-II) stations was installed 10 meters to the west of the mobile laboratory (measuring trace gases) and consisted of a 10 meter tower with the required sensors, master control electronics box, and antenna to transmit station data to the satellite. The station, via the satellite data link, transmitted the data to NCAR in Boulder, Colorado, where the data were archived by the NCAR/SSSF DEC MicroVAX computer.); update Definition (NCAR); delete Resource (null);
change note: 2021-11-18 08:33:32.0 [tstevens] Move Concepts delete broader relation (null); add broader relation (PAM-II [0e3131f5-f92d-441e-bba3-e28e55cfead7,825973] - Vehicles [8dc44d7b-e349-42ab-860e-18f5acfc1b28,835888]);
definition: Portable Automated Mesonet II (PAM-II) stations was installed 10 meters to the west of the mobile laboratory (measuring trace gases) and consisted of a 10 meter tower with the required sensors, master control electronics box, and antenna to transmit station data to the satellite. The station, via the satellite data link, transmitted the data to NCAR in Boulder, Colorado, where the data were archived by the NCAR/SSSF DEC MicroVAX computer.
in scheme: platforms

Vehicles
type: Concept