AUBURN/FORESTRY
type: Concept
definition: Our Vision for the School of Forestry & Wildlife Sciences: We bring unparalleled expertise, passion and commitment to address societys needs for enhanced quality of life and sustainable development of our renewable natural resources. We are an integral part of sound economic development of the state, region, nation and world. Summary Provided By: https://fp.auburn.edu/sfws/mission.aspx
in scheme: providers

ACADEMIC
type: Concept