DATA MANAGEMENT/DATA HANDLING
type: Concept

DATA INTEROPERABILITY
type: Concept
definition: Interoperability is the ability of two or more systems or components to exchange information and to use the information that has been exchanged.
in scheme: sciencekeywords

DATA REFORMATTING
type: Concept