WRI
type: Concept
definition: World Resources Institute (WRI) is an environmental think tank that goes beyond research to find practical ways to protect the earth and improve people's lives. WRI explores issues at the intersection of environmental protection and economic development. Work focuses on protecting Earth's living systems, increasing access to information, reversing global warming, and creating sustainable enterprise and opportunity. The scale of WRI's activity ranges from local studies to national, regional, and global assessments, and specific topics are grouped in the categories at the left. Website: "http://www.wri.org/" [Summary provided by the WRI.]
in scheme: providers

CONSORTIA/INSTITUTIONS
type: Concept