BBN
type: Concept
definition: Government customers turn to BBN for solutions that help make us safe and secure; business customers rely on us for breakthrough thinking that helps them bring new innovations to market and gives them a competitive edge. Summary Provided By: http://www.bbn.com/about/
in scheme: providers

COMMERCIAL
type: Concept