STERNA92
type: Concept
definition: The Joint Global Ocean Flux Study (JGOFS) was an international and multi-disciplinary project with participants from more than 20 countries. Its aim was to understand the processes controlling the cycling of carbon in the oceans, its exchange with the atmosphere and sea floor, and the sensitivity of these processes to climate changes. Summary Provided By: http://www.bodc.ac.uk/products/collaborative_products/jgofs_final/
in scheme: projects

S - U
type: Concept