REFLECTED SOLAR SUITE
type: Concept
definition: CLARREO Instruments The CLARREO mission is currently envisioned to consist of two duplicate observatories each carrying a payload of one infrared instrument suite, one reflected solar instrument suite and a Global Navigation Satellite System Radio Occultation (GNSS-RO) instrument system. Summary provided by http://clarreo.larc.nasa.gov/about-instrument.php Group: Instrument_Details Entry_ID: REFLECTED SOLAR SUITE Group: Instrument_Identification Instrument_Category: Earth Remote Sensing Instruments Instrument_Class: Passive Remote Sensing Instrument_Type: Spectrometers/Radiometers Instrument_Subtype: Imaging Spectrometers/Radiometers Short_Name: REFLECTED SOLAR SUITE Long_Name: Reflected Solar Instrument Suite (CLARREO) End_Group Group: Associated_Platforms Short_Name: CLARREO End_Group Online_Resource: http://clarreo.larc.nasa.gov/about-instrument.php Sample_Image: http://clarreo.larc.nasa.gov/images/Payload_breakdown-600w.png Creation_Date: 2010-08-05 Group: Instrument_Logistics Instrument_Owner: USA/NASA End_Group End_Group
in scheme: instruments

Imaging Spectrometers/Radiometers
type: Concept