AEROSOL FRACTION
type: Concept
change note: 2020-05-20 14:18:58.0 [sritz] Insert Concept add broader relation (AEROSOL FRACTION [101c2cd2-b135-430b-a9c6-b710dee48d78,560185] - AEROSOL BACKSCATTER [f795b88f-1aba-4548-97f6-7b587e8ba451,85545]);
definition: The fraction of liquid phase, 1 - x, which, after flashing to the atmosphere, remains suspended as an aerosol.
in scheme: sciencekeywords

AEROSOL BACKSCATTER
type: Concept