DOI/USGS/GD/MRP
type: Concept
definition: The U.S. Geological Survey (USGS) Mineral Resources Program provides and communicates current, impartial information on the occurrence, quality, quantity, and availability of mineral resources. Website: "http://minerals.usgs.gov/" [Summary provided by the USGS]
in scheme: providers

USGS
type: Concept