A - C
type: Concept

CROPCLIM
type: Concept
change note: 2018-08-09 13:51:50.0 [tstevens] update PrefLabel (CROPCLIM);
change note: 2017-09-13 07:42:25.0 [tstevens] Insert Concept add broader relation (CROMPCLIM [10dacf4d-3058-43a2-9cc4-9752ff5f6859,310179] - A - C [0c89f3f4-7ab1-43ce-89ee-795d35f0e30a,292045]);
change note: 2017-09-13 07:43:32.0 [tstevens] insert AltLabel (id: null category: primary text: Climate Effects on Food Supply language code: en); insert Definition (id: null text: In the coming decades the agricultural sector faces many challenges stemming from growing global populations, land degradation, and loss of cropland to urbanization. Although food production has been able to keep pace with population growth on the global scale, periodically there are serious regional deficits, and poverty related nutritional deficiencies affect close to a billion people globally. In this century climate change is one factor that could affect food production and availability in many parts of the world, particularly those most prone to drought and famine. These data sets are based on two studies that use similar methods to identify likely impacts of climate change on crop yields. The first, Potential Impacts of Climate Change on World Food Supply: Data Sets from a Major Crop Modeling Study, was released in 2001, and the second, Effects of Climate Change on Global Food Production from SRES Emissions and Socioeconomic Scenarios, was released in 2009. language code: en);
definition: In the coming decades the agricultural sector faces many challenges stemming from growing global populations, land degradation, and loss of cropland to urbanization. Although food production has been able to keep pace with population growth on the global scale, periodically there are serious regional deficits, and poverty related nutritional deficiencies affect close to a billion people globally. In this century climate change is one factor that could affect food production and availability in many parts of the world, particularly those most prone to drought and famine. These data sets are based on two studies that use similar methods to identify likely impacts of climate change on crop yields. The first, Potential Impacts of Climate Change on World Food Supply: Data Sets from a Major Crop Modeling Study, was released in 2001, and the second, Effects of Climate Change on Global Food Production from SRES Emissions and Socioeconomic Scenarios, was released in 2009.
in scheme: projects