ENTRAINMENT
type: Concept
change note: 2013-08-26 09:03:34.0 [tbs1979] insert Definition (id: null text: The process by which surface sediment is incorporated into a fluid flow (such as air, water or even ice ) as part of the operation of erosion. language code: en);
change note: 2013-08-06 14:59:43.0 [tbs1979] Insert Concept add broader relation (ENTRAINMENT [10ec2826-c4ac-4373-ad05-9bb4eb35b360,105661] - GLACIAL PROCESSES [b409a30b-0e3f-4592-bec9-7d371797b4a9,85295]);
definition: The process by which surface sediment is incorporated into a fluid flow (such as air, water or even ice ) as part of the operation of erosion.
in scheme: sciencekeywords

GLACIAL PROCESSES
type: Concept