ECOSTRESS
type: Concept
change note: 2018-04-30 13:09:37.0 [tstevens] insert AltLabel (id: null category: primary text: ECOsystem Spaceborne Thermal Radiometer Experiment on Space Station language code: en); insert Definition (id: null text: The ECOsystem Spaceborne Thermal Radiometer Experiment on Space Station (ECOSTRESS) will measure the temperature of plants and use that information to better understand how much water plants need and how they respond to stress. language code: en);
change note: 2018-04-30 13:07:55.0 [tstevens] Insert Concept add broader relation (ECOSTRESS [1138ec18-a2a5-4cff-84bc-ce5fdfe29f0a,367567] - Imaging Spectrometers/Radiometers [944b7691-af37-4fb4-9393-c114e7997829,347979]);
definition: The ECOsystem Spaceborne Thermal Radiometer Experiment on Space Station (ECOSTRESS) will measure the temperature of plants and use that information to better understand how much water plants need and how they respond to stress.
in scheme: instruments

Imaging Spectrometers/Radiometers
type: Concept