ICEBERGS
type: Concept
definition: A piece of ice that has broken off from the end of a glacier that terminates in water. Only about 10 percent of its mass is above the surface of the water.
in scheme: sciencekeywords

SEA ICE
type: Concept