TUNABLE DIODE LASER
type: Concept
change note: 2021-08-05 17:54:11.0 [sritz] insert AltLabel (id: null category: primary text: TUNABLE DIODE LASER language code: en);
definition: A TUNABLE DIODE LASER is a solid-state laser in which as lasing is achieved by passing an injection current through the active region of a semiconductor across the p-n junction; tunable meaning it is used with a technique based upon the measurement of light absorption upon irridating a sample using a tunable laser source.
in scheme: instruments

Photon/Optical Detectors
type: Concept