VSM
type: Concept
change note: 2019-08-05 11:08:43.0 [tstevens] insert AltLabel (id: null category: primary text: Vibrating Sample Magnetometers language code: en); insert Definition (id: null text: A vibrating-sample magnetometer (VSM) (also referred to as a Foner magnetometer) is a scientific instrument that measures magnetic properties. language code: en);
change note: 2019-08-05 11:07:30.0 [tstevens] Insert Concept add broader relation (VSM [1300915c-2564-4859-9e6c-8b2257adfadc,369017] - MAGNETOMETERS [deac2632-5c17-4d15-ae92-c61ebc5a405a,348905]);
definition: A vibrating-sample magnetometer (VSM) (also referred to as a Foner magnetometer) is a scientific instrument that measures magnetic properties.
in scheme: instruments

MAGNETOMETERS
type: Concept