CA/NRCAN/ESS/GSC/CGD
type: Concept
definition: The Earth Sciences Sector of Natural Resources Canada provides Canadians with the acquisition, interpretation, maintenance and distribution of maps, information, technology, standards and expertise concerning the Canadian landmass and offshore in the fields of geoscience, geodesy, mapping, surveying, and remote sensing. Summary Provided by: http://ess.nrcan.gc.ca/abosuj/whaquo_e.php
in scheme: providers

CANADA
type: Concept