SEDIMENT CHEMISTRY
type: Concept
change note: 2017-03-10 08:08:56.0 [tstevens] insert Definition (id: null text: The chemical makeup of silt, sand, rocks, fossils, and other matter carried and deposited by water, wind, or ice. language code: en);
change note: 2013-08-06 15:03:45.0 [tbs1979] Insert Concept add broader relation (SEDIMENT CHEMISTRY [134fd984-9b26-4ceb-9084-3bffc0c5a321,105683] - SEDIMENTATION [b609e525-db71-4634-b569-f8aab5ad544e,105681]);
definition: The chemical makeup of silt, sand, rocks, fossils, and other matter carried and deposited by water, wind, or ice.
in scheme: sciencekeywords

SEDIMENTATION
type: Concept