TUNAS AND ALLIES
type: Concept
change note: 2013-12-31 10:25:43.0 [epneff] Insert Concept add broader relation (TUNAS AND ALLIES [1369d226-2b9b-4f69-a197-6e24523b21e7,106083] - PERCH-LIKE FISHES [85b2ba83-b81c-45a6-98d1-07b36040fe45,84373]);
definition: Members of the Family Scombridae, including tunas, albacores, bonitos, and mackerels
in scheme: sciencekeywords

PERCH-LIKE FISHES
type: Concept