OPTICAL DEPTH/THICKNESS
type: Concept
definition: In radiative transfer, optical thickness or optical depth is the mass of a given absorbing or emitting material in a vertical column of unit cross-sectional area and extending between two specified levels.
in scheme: sciencekeywords

ATMOSPHERIC RADIATION
type: Concept