SEA ICE MOTION
type: Concept
definition: Refers to the movement and direction of ice fields or floes. Ice motion processes include: diverging, compacting, and shearing.
in scheme: sciencekeywords

SEA ICE
type: Concept