DMI/COI
type: Concept
change note: 2013-06-10 11:21:42.0 [mpmorahan] insert AltLabel (id: null text: Danish Meteorological Institute, Center for Ocean and Ice language code: en);
change note: 2013-06-10 11:18:37.0 [mpmorahan] Insert Concept add broader relation (DMI/COI [15e8c48f-ece5-4502-b255-e66ec88c6f10,105201] - DENMARK [75225b4b-26dd-4165-8e7d-f8ae69f36544,68355]);
definition: DMI is an institution under the Ministry of Climate and Energy The Centre for Ocean and Ice is DMI's department for marine information and consultancy. Our main activities are storm surge warning, ice charting, waves, ocean currents, ocean monitoring by satellite, the climate of the ocean and marine data.
in scheme: providers

DENMARK
type: Concept