RI/DOA
type: Concept
definition: The Department of Administrative Services provides a wide variety of services to a number of different customers. Some of our primary resource management services include: Accounting Services, Budgeting, Human Resources / Management Information, Technology, Purchasing, Capital Project Management, Facilities Management, Risk Management, Statewide Planning and Legal Services. Summary Provided By: http://www.admin.ri.gov/
in scheme: providers

RHODE ISLAND
type: Concept