CLOUD BASE PRESSURE
type: Concept
change note: 2013-02-14 13:33:00.0 [mpmorahan] Move Concepts add broader relation (CLOUD BASE PRESSURE [17f212af-e782-4196-b467-060699ecf4ca,63299] - CLOUD PROPERTIES [c9e429cb-eff0-4dd3-9eca-527e0081f65c,82133]); delete broader relation (null);
definition: Atmospheric pressure observed at the base of a cloud.
in scheme: sciencekeywords

CLOUD PROPERTIES
type: Concept