ASK-A ECOLOGIST
type: Concept
definition: Digital reference services that use the Internet to connect people with people who can answer questions about the ecological sciences.
in scheme: sciencekeywords

DIGITAL/VIRTUAL REFERENCE DESKS
type: Concept