FERTILIZERS
type: Concept
definition: Any natural or manufactured material added to the soil in order to supply one or more plant nutrients. The term is generally applied to inorganic materials other than lime or gypsum sold in the trade.
in scheme: sciencekeywords

AGRICULTURAL CHEMICALS
type: Concept