NON-METALLIC MINERAL VERTICAL/GEOGRAPHIC DISTRIBUTION
type: Concept
change note: 2013-03-22 08:34:54.0 [tbs1979] insert Definition (id: null text: The vertical and geographic distribution of non-metallic minerals within the solid Earth. language code: en);
change note: 2013-03-05 13:20:53.0 [tbs1979] Insert Concept add broader relation (NON-METALLIC MINERAL VERTICAL/GEOGRAPHIC DISTRIBUTION [1980c6c6-50f0-45a1-9a28-668f1372c09e,83063] - NON-METALLIC MINERALS [d64a9627-3cf8-41d3-aaf7-8c2c46fb4a13,63025]);
definition: The vertical and geographic distribution of non-metallic minerals within the solid Earth.
in scheme: sciencekeywords

NON-METALLIC MINERALS
type: Concept