U-HULL/HMAP
type: Concept
definition: The History of Marine Animal Populations (HMAP), the historical component of the Census of Marine Life (CoML), aims to improve our understanding of ecosystem dynamics, specifically with regard to long-term changes in stock abundance, the ecological impact of large-scale harvesting by man, and the role of marine resources in the historical development of human society. Since the earliest historical records, man has harvested a variety of different animals from the oceans. The effects of this activity on marine populations have been of increasing interest over the last century. While ecologists have traditionally aimed to identify the current conditions of many of the animal populations affected both directly and indirectly by harvesting, much less focus has been given to the status of affected populations in earlier times. Summary Provided By: http://www.coml.org/descrip/hmap.htm
in scheme: providers

ACADEMIC
type: Concept