SPECIES DOMINANCE INDICES
type: Concept
definition: Dominance is the condition in communities or in vegetational strata in which one or more species, by means of their number, coverage, or size, have considerable influence upon or control of the conditions of existence of associated species.
in scheme: sciencekeywords

COMMUNITY DYNAMICS
type: Concept