BACKGROUND INFORMATION
type: Concept
definition: Background Information Services are defined as Education/Outreach Services that are designed to provide supplemental or background information on a particular subject in Earth Science and/or Global Environmental Change.
in scheme: sciencekeywords

CURRICULUM SUPPORT
type: Concept