Galileo
type: Concept
change note: 2017-08-15 07:41:17.0 [tstevens] update AltLabel (Europe's European Satellite Navigation System);
change note: 2017-08-14 15:38:33.0 [tstevens] Insert Concept add broader relation (Galileo [1a66ab14-1844-49ac-ae76-ad8c489c821a,309967] - Galileo [bf71449f-834e-4183-9006-cf94f7eb5520,309955]);
change note: 2017-08-15 10:08:22.0 [tstevens] insert Definition (id: null text: Galileo is the European GNSS and provides accurate positioning and timing information on a global basis. The Galileo constellation consists of 18 operational satellites. language code: en);
change note: 2017-08-14 15:39:53.0 [tstevens] insert AltLabel (id: null category: primary text: Europe’s European Satellite Navigation System language code: en);
definition: Galileo is the European GNSS and provides accurate positioning and timing information on a global basis. The Galileo constellation consists of 18 operational satellites.
in scheme: instruments

Galileo
type: Concept