Permanent Land Sites
type: Concept

ENTLN
type: Concept
change note: 2014-01-23 11:12:38.0 [saritz] Added Primary Alternate Label and Definition. insert AltLabel (id: null text: Earth Networks Total Lightning Network (ENTLN) language code: en); insert Definition (id: null text: The Earth Networks Total Lightning Network (ENTLN) is an integrated in-cloud (IC) lightning and cloud-to-ground (CG) detection network deployed on a global basis capable of detecting long range in-cloud lightning at high efficiencies critical for the advanced prediction of severe weather phenomena. language code: en);
change note: 2021-11-18 08:41:01.0 [tstevens] Move Concepts delete broader relation (null); add broader relation (ENTLN [1ab2e0db-8911-434d-a6ba-3917730e83a6,826028] - Permanent Land Sites [0ec10fd9-492c-498a-b6d8-e2840cc3643b,835887]);
change note: 2014-01-23 11:11:11.0 [saritz] Insert Concept add broader relation (ENTLN [1ab2e0db-8911-434d-a6ba-3917730e83a6,106101] - WEATHER STATIONS/NETWORKS [57b7373d-5c21-4abb-8097-a410adc2a074,73471]);
definition: The Earth Networks Total Lightning Network (ENTLN) is an integrated in-cloud (IC) lightning and cloud-to-ground (CG) detection network deployed on a global basis capable of detecting long range in-cloud lightning at high efficiencies critical for the advanced prediction of severe weather phenomena. Group: Platform_Details Entry_ID: ENTLN Group: Platform_Identification Platform_Category: Aircraft Short_Name: ENTLN Long_Name: Earth Networks Total Lightning Network (ENTLN) End_Group Group: Platform_Associated_Instruments Short_Name: ENLS End_Group Creation_Date: 2014-01-23 End_Group
in scheme: platforms