Models
type: Concept

CESM
type: Concept
change note: 2015-08-10 14:39:48.0 [epneff] Insert Concept add broader relation (CESM [1b492235-f1fa-47d9-aae5-278812d29e7d,158211] - Models/Analyses [113ecbc2-ab36-4d58-a96c-a6ce0106e749,143215]);
change note: 2021-11-30 13:37:56.0 [tstevens] Move Concepts delete broader relation (null); add broader relation (CESM [1b492235-f1fa-47d9-aae5-278812d29e7d,826029] - Models [0a184cdc-c074-4946-90a6-02f03c686341,835911]);
change note: 2022-03-10 08:30:53.0 [tstevens] insert Definition (id: null text: The Community Climate Model (CCM) was created by NCAR in 1983 as a freely available global atmosphere model for use by the wider climate research community. The formulation of the CCM has steadily improved over the past two decades, computers powerful enough to run the model have become relatively inexpensive and widely available, and usage of the model has become widespread in the university community, and at some national laboratories. A limitation of the original CCM was that it did not include models of the global ocean and sea ice. Accordingly, in 1994, NCAR scientists submitted a plan to National Science Foundation (NSF) to develop and use a Climate System Model (CSM) that was to include models of the atmosphere, land surface, ocean, and sea ice. These components were to be coupled without resorting to any "flux adjustments." The plan was to focus initially on the physical aspects of the climate system, and then in a subsequent version to improve biogeochemistry and coupling to the upper atmosphere. The first phase of this project was the model development by the NCAR staff, after which the model and associated data sets were to be made available to the scientific community. In addition, a new governance structure was promised, in which the interested scientific community would be given a fair opportunity to participate in all aspects of the CSM. NSF approved the plan, and model development began immediately. In May 1996, the first CSM Workshop was held in Breckenridge, Colorado. At this workshop the CSM components and the results of an early equilibrium climate simulation were presented. Working groups began to form, and the nature of future CSM governance was discussed. At the final plenary session of the workshop, the proposed management structure was discussed, modified, and adopted. At that point, the second phase of CSM, including full participation of the scientific community, had begun.…
change note: 2015-08-10 14:40:14.0 [epneff] Added long name insert AltLabel (id: null text: NCAR Community Earth System Model language code: en);
definition: The Community Climate Model (CCM) was created by NCAR in 1983 as a freely available global atmosphere model for use by the wider climate research community. The formulation of the CCM has steadily improved over the past two decades, computers powerful enough to run the model have become relatively inexpensive and widely available, and usage of the model has become widespread in the university community, and at some national laboratories. A limitation of the original CCM was that it did not include models of the global ocean and sea ice. Accordingly, in 1994, NCAR scientists submitted a plan to National Science Foundation (NSF) to develop and use a Climate System Model (CSM) that was to include models of the atmosphere, land surface, ocean, and sea ice. These components were to be coupled without resorting to any "flux adjustments." The plan was to focus initially on the physical aspects of the climate system, and then in a subsequent version to improve biogeochemistry and coupling to the upper atmosphere. The first phase of this project was the model development by the NCAR staff, after which the model and associated data sets were to be made available to the scientific community. In addition, a new governance structure was promised, in which the interested scientific community would be given a fair opportunity to participate in all aspects of the CSM. NSF approved the plan, and model development began immediately. In May 1996, the first CSM Workshop was held in Breckenridge, Colorado. At this workshop the CSM components and the results of an early equilibrium climate simulation were presented. Working groups began to form, and the nature of future CSM governance was discussed. At the final plenary session of the workshop, the proposed management structure was discussed, modified, and adopted. At that point, the second phase of CSM, including full participation of the scientific community, had begun. The period since this 1996 workshop has been a time of substantial…
in scheme: platforms