OCEAN SALINITY RECONSTRUCTION
type: Concept
change note: 2012-07-26 11:40:55.0 [mpmorahan] insert Definition (id: null text: Reconstruction of past ocean salinity based on paleoclimate proxy records. language code: en);
change note: 2012-06-27 08:44:21.0 [mpmorahan] Insert Concept add broader relation (OCEAN SALINITY RECONSTRUCTION [1ba98ab7-dee3-4b15-aea1-179ecd8f6e7d,40161] - PALEOCLIMATE RECONSTRUCTIONS [6f6423e8-ab4e-4572-8982-d9c40f64e28b,40149]);
definition: Reconstruction of past ocean salinity based on paleoclimate proxy records.
in scheme: sciencekeywords

PALEOCLIMATE RECONSTRUCTIONS
type: Concept