UVM/GIEE
type: Concept
definition: The Gund Institute for Ecological Economics unites pioneering experts, leading educators, students, and others from around the world and across a wide variety of academic and environmental disciplines. We're a diverse collection of dedicated individuals as you'll see in this introduction to the people who are carrying our vision forward. Learn more2 about the history of the Gund Institute for Ecological Economics. Summary Provided By: http://www.uvm.edu/giee/?Page=about/index.html&SM=about/about_menu.html
in scheme: providers

ACADEMIC
type: Concept