SHORELINES
type: Concept
change note: 2021-10-19 08:33:57.0 [tstevens] Insert Concept add narrower relation (SHORELINES [1d3b4eb7-9931-44bf-8457-26847051b7a8,775034] - SHORELINE MAPPING [3472f70b-874f-4dc5-87db-4b3ebc4b9aaa,778189]);
definition: Representation of the coast in vector format used to delineate the land-sea boundary in maps or geographic information systems.
in scheme: sciencekeywords

SHORELINE MAPPING
type: Concept

COASTAL PROCESSES
type: Concept