UC-SB/ICESS
type: Concept
definition: The Institute for Computational Earth System Science(ICESS), located on the University of California, Santa Barbara campus, provides an environment in which Earth and computer science are strongly coupled. Their focus is on research and graduate education in Earth sciences, with emphasis on processes governing the environmental optics of the Earth. Website: http://www.icess.ucsb.edu/ [Summary provided by ICESS.]
in scheme: providers

ACADEMIC
type: Concept