COSMOS-SSP
type: Concept
change note: 2020-09-28 09:03:22.0 [tstevens] insert AltLabel (id: null category: primary text: Hydroinnova COSMOS Stationary Soil Probe language code: en); insert Definition (id: null text: Hydroinnova offers several configurations of the Cosmic-Ray Soil Moisture Probe. The baseline system is a complete data logging and telemetry solution which includes integrated barometric pressure, humidity, temperature sensors. Our datalogger will also support common external sensors including capacitance probes, water content reflectometers, tipping bucket rain gauges and many other analog sensors commonly used in environmental measurements. language code: en);
change note: 2020-09-28 09:01:41.0 [tstevens] Insert Concept add broader relation (COSMOS-SSP [1f4a8787-557f-4211-8617-c17bc09b6415,560722] - Recorders/Loggers [ebfff02c-2e5a-476e-aafb-c00167bf2daa,546147]);
definition: Hydroinnova offers several configurations of the Cosmic-Ray Soil Moisture Probe. The baseline system is a complete data logging and telemetry solution which includes integrated barometric pressure, humidity, temperature sensors. Our datalogger will also support common external sensors including capacitance probes, water content reflectometers, tipping bucket rain gauges and many other analog sensors commonly used in environmental measurements.
in scheme: instruments

Recorders/Loggers
type: Concept