DISPERSION FREQUENCY
type: Concept
change note: 2016-03-31 10:05:18.0 [gee-cee] insert Definition (id: null text: The number of clay particles that separate from one other in moist oil in a single period. language code: en);
change note: 2016-03-31 10:04:51.0 [gee-cee] Insert Concept add broader relation (DISPERSION FREQUENCY [1fa631de-797f-4649-aa26-9f814ddcdb9b,158785] - DISPERSION [d2d4ee50-99ed-4ee7-b957-22271a60c031,85031]);
definition: The number of clay particles that separate from one other in moist oil in a single period.
in scheme: sciencekeywords

DISPERSION
type: Concept