MN/OET/MNGEO
type: Concept
change note: 2014-03-29 14:04:46.0 [sgrebas] insert AltLabel (id: null text: Minnesota Geospatial Information Office, Office of Enterprise Technology, Minnesota language code: en);
change note: 2014-03-29 14:03:59.0 [sgrebas] Insert Concept add broader relation (MN/OET/MNGEO [1ff07fdd-9f88-4c87-8b2a-6e1a8dc4dfd9,106269] - MINNESOTA [7697ef45-ee36-4643-b110-e3f9777f4ede,66795]);
definition: The Minnesota Geospatial Information Office, known as MnGeo, was established in May 2009 as the first state agency with legislatively defined responsibility for coordinating GIS within Minnesota. It was created based upon a recommendation made by the Drive to Excellence Sub-Cabinet to pursue an enterprise strategy to implementing GIS within the state. Drive to Excellence was a high-level state-government reform program that recommended government reforms to improve government services. MnGeo succeeds the Land Management Information Center. Created in 1977 as the first state agency anywhere exclusively devoted to providing GIS services within state government, LMIC's role evolved from a project-oriented program to Minnesota's "ad hoc" GIS coordinating organization. With the passage of legislation to create MnGeo, LMIC ceased to exist. However, all of LMIC's functions essential to MnGeo's coordination responsibilities, along with LMIC's resources, were transferred to the new office. The process of developing the recommendation included a large cross-section of stakeholders and was guided by an Enterprise GIS steering committee and workgroups that included members of the Strategic Planning Committee of the Minnesota Governor's Council on Geographic Information. Many of these contributors then served on the State Government Geospatial Advisory Council which was active from October 2009 - August 2013. [Summary provided by Minnesota Geospatial Information Office.]
in scheme: providers

MINNESOTA
type: Concept