GCOM-C
type: Concept
change note: 2019-01-02 10:08:02.0 [mmorahan] update AltLabel (Global Change Observation Mission-Climate);
change note: 2018-11-13 06:27:05.0 [mmorahan] insert AltLabel (id: null category: primary text: Global Change Observation Mission – Climate language code: en); insert Definition (id: null text: Global Change Observation Mission - Climate "SHIKISAI" (GCOM-C) language code: en);
change note: 2018-11-13 06:24:40.0 [mmorahan] Insert Concept add broader relation (GCOM-C [2027f032-4497-4f8d-a185-5a850ce7582f,368269] - G - I [af0968ce-ffe3-44a0-86de-2ec9b9a8fa5d,351587]);
definition: Global Change Observation Mission - Climate "SHIKISAI" (GCOM-C)
in scheme: projects

G - I
type: Concept