UA/SRI/DSITS/SERVICES
type: Concept
definition: Space Research Institute was established in 1996 at the National Space Agency of Ukraine and National Academy of Sciences of Ukraine for organisation of scientific space researches in the country, conducting and co-ordination of scientific and engineering activities in the area of peaceful exploration and use of outer space. Summary Provided By: http://www.nkau.gov.ua/nsau/catalogNEW.nsf/0/CAF1AAABA64D4075C3256BF8004BF967?OpenDocument&Lang=E
in scheme: providers

UKRAINE
type: Concept