NASA/JPL/EMIT
type: Concept
change note: 2022-11-03 16:27:09.0 [sritz] insert AltLabel (id: null category: primary text: Earth Surface Mineral Dust Source Investigation, Jet Propulsion Laboratory, NASA language code: en);
change note: 2021-11-30 17:41:19.0 [sritz] Insert Concept add broader relation (NASA/JPL/EMIT [2180640a-ec49-4a1a-a063-460fcdb587a6,835920] - NASA [4fd0aa9d-1a80-4dde-8452-c69b5c4d08cc,822213]);
definition: The Earth Surface Mineral Dust Source Investigation (EMIT) science team at NASA’s Jet Propulsion Laboratory will generate new, more accurate mineral composition maps of Earth’s dust source regions.
in scheme: providers

NASA
type: Concept