PERCOLATION AMOUNT
type: Concept
change note: 2016-03-31 10:46:23.0 [gee-cee] insert Definition (id: null text: The amount of fluids being filtered through porous materials. language code: en);
change note: 2016-03-31 10:46:00.0 [gee-cee] Insert Concept add broader relation (PERCOLATION AMOUNT [22566296-aea0-4f01-93c0-fb3256051f27,158805] - PERCOLATION [d64094ae-774b-4435-8f2e-a54d114e5555,85539]);
definition: The amount of fluids being filtered through porous materials.
in scheme: sciencekeywords

PERCOLATION
type: Concept