SOIL INFILTRATION
type: Concept
definition: The entry of water into soil. Also, the infiltration flux is the volume of water entering a specified cross-sectional area of soil per unit time [L t-1].
in scheme: sciencekeywords

SOILS
type: Concept